Thunkable — ошибка создания ключа

Привет всем! Иногда играюсь с конструкторами типа Thunkable. Сегодня в процессе компилирования проекта в файл .apk вылетела ошибка:
Error: Command failed: cd /thunkable/androidBuildServer/…/thunkableCompanion/android/; ./gradlew AssembleRelease FAILURE: Build failed with an exception. * What went wrong: Execution failed for task ‘:app:packageRelease’. > A failure occurred while executing com.android.build.gradle.internal.tasks.Workers$ActionFacade > com.android.ide.common.signing.KeytoolException: Failed to read key AndroidKey from store “/thunkable/thunkableCompanion/android/upload.keystore”: Keystore was tampered with, or password was incorrect * Try: Run with —stacktrace option to get the stack trace. Run with —info or —debug option to get more log output. Run with —scan to get full insights. * Get more help at https://help.gradle.org 1 BUILD FAILED in 57s

Решение ошибки очень простое: экспортируем ключ из приложения, которое вы создадите специально для временных целей (из этого приложения берем ключ) — и импортируем в то приложение, в процессе компиляции которого вылетела ошибка.

Подсказка для решения была найдена в процессе чтения документации после очередного обновления. Вот…

Ерунда, конечно, но вдруг кому-то пригодится 🙂 Спасибо за внимание! Как всегда — в случае возникновения вопросов пишите на почту, или в Телеграм.